BDBM50231285 CHEMBL544553
SMILES Cl.Cc1cc(cc(C)n1)-c1c(F)cc2c(scc(C(O)=O)c2=O)c1F
InChI Key InChIKey=NZVYAFRANYVKLS-UHFFFAOYSA-N
Data  1 EC50
  Tab Delimited (TSV)   2D SDfile   Computed 3D by Vconf -m prep SDfile
Find this compound or compounds like it in BindingDB:
Activity Spreadsheet -- Enzyme Inhibition Constant Data from BindingDB
Found 1 hit for monomerid = 50231285
TargetDNA topoisomerase 2-alpha/2-beta(Homo sapiens (Human))
Sterling Winthrop Pharmaceuticals Research Division
Curated by ChEMBL
LigandPNGBDBM50231285(CHEMBL544553)
Affinity DataEC50: >1.40E+5nM. Assay description: Tested for inhibition of topoisomerase II isolated from HeLa cells by DNA-cleavage assay
In DepthDetails ArticlePubMed