BDBM50231445 CHEMBL251834::N-(6-(2-(4-(benzo[d]isothiazol-3-yl)piperazin-1-yl)ethyl)-2,3-dihydro-1H-inden-1-yl)isoxazole-5-carboxamide
SMILES O=C(NC1CCc2ccc(CCN3CCN(CC3)c3nsc4ccccc34)cc12)c1ccno1
InChI Key InChIKey=LHFRREYTABIJEO-UHFFFAOYSA-N
Data  5 KI
  Tab Delimited (TSV)   2D SDfile   Computed 3D by Vconf -m prep SDfile
Find this compound or compounds like it in BindingDB:
Activity Spreadsheet -- Enzyme Inhibition Constant Data from BindingDB
Found 5 hits for monomerid = 50231445
Target5-hydroxytryptamine receptor 2A(Homo sapiens (Human))
Pfizer
Curated by ChEMBL
LigandPNGBDBM50231445(CHEMBL251834 | N-(6-(2-(4-(benzo[d]isothiazol-3-yl...)
Affinity DataKi:  0.0800nM. Assay description: Displacement of [3H]ketanserin from human 5HT2A receptor expressed in Swiss 3T3 cells
In DepthDetails ArticlePubMed
TargetAlpha-1A adrenergic receptor(Rattus norvegicus (Rat))
Pfizer
Curated by ChEMBL
LigandPNGBDBM50231445(CHEMBL251834 | N-(6-(2-(4-(benzo[d]isothiazol-3-yl...)
Affinity DataKi:  1.88nM. Assay description: Displacement of [3H]prazosin from rat adrenergic alpha1A receptor expressed in fibroblast cells
In DepthDetails ArticlePubMed
TargetD(2) dopamine receptor(Homo sapiens (Human))
Pfizer
Curated by ChEMBL
LigandPNGBDBM50231445(CHEMBL251834 | N-(6-(2-(4-(benzo[d]isothiazol-3-yl...)
Affinity DataKi:  3nM. Assay description: Displacement of [3H]spiperone from human D2L receptor expressed in CHO cells
In DepthDetails ArticlePubMed
Target5-hydroxytryptamine receptor 1A(Homo sapiens (Human))
Pfizer
Curated by ChEMBL
LigandPNGBDBM50231445(CHEMBL251834 | N-(6-(2-(4-(benzo[d]isothiazol-3-yl...)
Affinity DataKi:  6.5nM. Assay description: Displacement of [3H]8OHDPAT from human 5HT1A receptor
In DepthDetails ArticlePubMed
TargetPotassium voltage-gated channel subfamily H member 2(Homo sapiens (Human))
Pfizer
Curated by ChEMBL
LigandPNGBDBM50231445(CHEMBL251834 | N-(6-(2-(4-(benzo[d]isothiazol-3-yl...)
Affinity DataKi:  150nM. Assay description: Displacement of [3H]dofetilide from human ERG channel expressed in HEK293 cells
In DepthDetails ArticlePubMed