BDBM50231476 CHEMBL399423::N-[2-(2-Phenyl-5-m-tolyl-pyrrol-1-yl)-acetyl]-guanidine
SMILES Cc1cccc(c1)-c1ccc(-c2ccccc2)n1CC(=O)NC(N)=N
InChI Key InChIKey=DWHFHJVLUCKZFN-UHFFFAOYSA-N
Data  1 IC50
  Tab Delimited (TSV)   2D SDfile   Computed 3D by Vconf -m prep SDfile
Find this compound or compounds like it in BindingDB:
Activity Spreadsheet -- Enzyme Inhibition Constant Data from BindingDB
Found 1 hit for monomerid = 50231476
TargetBeta-secretase 1(Homo sapiens (Human))
Wyeth Research
Curated by ChEMBL
LigandPNGBDBM50231476(CHEMBL399423 | N-[2-(2-Phenyl-5-m-tolyl-pyrrol-1-y...)
Affinity DataIC50:  4.60E+3nM. Assay description: Inhibition of BACE1 by FRET assay
In DepthDetails ArticlePubMed