BDBM50231486 CHEMBL401171::N-{2-[2-(4-allyloxy-phenyl)-5-phenyl-pyrrol-1-yl]-acetyl}-guanidine
SMILES NC(=N)NC(=O)Cn1c(ccc1-c1ccc(OCC=C)cc1)-c1ccccc1
InChI Key InChIKey=FJXMECHSMZCEED-UHFFFAOYSA-N
Data  1 IC50
  Tab Delimited (TSV)   2D SDfile   Computed 3D by Vconf -m prep SDfile
Find this compound or compounds like it in BindingDB:
Activity Spreadsheet -- Enzyme Inhibition Constant Data from BindingDB
Found 1 hit for monomerid = 50231486
TargetBeta-secretase 1(Homo sapiens (Human))
Wyeth Research
Curated by ChEMBL
LigandPNGBDBM50231486(CHEMBL401171 | N-{2-[2-(4-allyloxy-phenyl)-5-pheny...)
Affinity DataIC50:  1.70E+3nM. Assay description: Inhibition of BACE1 by FRET assay
In DepthDetails ArticlePubMed