BDBM50231500 CHEMBL254057::N-{2-[2-(4-methoxy-phenyl)-5-(4-phenoxy-phenyl)-pyrrol-1-yl]-acetyl}-guanidine
SMILES COc1ccc(cc1)-c1ccc(-c2ccc(Oc3ccccc3)cc2)n1CC(=O)NC(N)=N
InChI Key InChIKey=RSPOXCNTFDTLQG-UHFFFAOYSA-N
Data  1 IC50
  Tab Delimited (TSV)   2D SDfile   Computed 3D by Vconf -m prep SDfile
Find this compound or compounds like it in BindingDB:
Activity Spreadsheet -- Enzyme Inhibition Constant Data from BindingDB
Found 1 hit for monomerid = 50231500
TargetBeta-secretase 1(Homo sapiens (Human))
Wyeth Research
Curated by ChEMBL
LigandPNGBDBM50231500(CHEMBL254057 | N-{2-[2-(4-methoxy-phenyl)-5-(4-phe...)
Affinity DataIC50:  500nM. Assay description: Inhibition of BACE1 by FRET assay
In DepthDetails ArticlePubMed