BDBM50231683 3-(ethylamino)-N-((2S,3R)-3-hydroxy-4-(1-isobutoxy-2-methylpropan-2-ylamino)-1-phenylbutan-2-yl)-5-(2-oxopyrrolidin-1-yl)benzamide::CHEMBL252655
SMILES CCNc1cc(cc(c1)C(=O)N[C@@H](Cc1ccccc1)[C@H](O)CNC(C)(C)COCC(C)C)N1CCCC1=O
InChI Key InChIKey=DXLLAPMROUKAHN-WUFINQPMSA-N
Data  3 IC50
  Tab Delimited (TSV)   2D SDfile   Computed 3D by Vconf -m prep SDfile
Find this compound or compounds like it in BindingDB:
Activity Spreadsheet -- Enzyme Inhibition Constant Data from BindingDB
Found 3 hits for monomerid = 50231683
TargetBeta-secretase 1(Homo sapiens (Human))
Glaxosmithkline
Curated by ChEMBL
LigandPNGBDBM50231683(3-(ethylamino)-N-((2S,3R)-3-hydroxy-4-(1-isobutoxy...)
Affinity DataIC50:  790nM. Assay description: Inhibition of BACE1
In DepthDetails ArticlePubMed
TargetCathepsin D(Homo sapiens (Human))
Glaxosmithkline
Curated by ChEMBL
LigandPNGBDBM50231683(3-(ethylamino)-N-((2S,3R)-3-hydroxy-4-(1-isobutoxy...)
Affinity DataIC50:  2.23E+4nM. Assay description: Inhibition of cathepsin D
In DepthDetails ArticlePubMed
TargetBeta-secretase 2(Homo sapiens (Human))
Glaxosmithkline
Curated by ChEMBL
LigandPNGBDBM50231683(3-(ethylamino)-N-((2S,3R)-3-hydroxy-4-(1-isobutoxy...)
Affinity DataIC50:  6.90E+4nM. Assay description: Inhibition of BACE2
In DepthDetails ArticlePubMed