BDBM50231692 CHEMBL252495::N-((2S,3R)-4-((R)-2,3-dihydro-1H-inden-1-ylamino)-3-hydroxy-1-phenylbutan-2-yl)-3-(ethylamino)-5-(2-oxopyrrolidin-1-yl)benzamide::TCMDC-132414
SMILES CCNc1cc(cc(c1)C(=O)N[C@@H](Cc1ccccc1)[C@H](O)CN[C@@H]1CCc2ccccc12)N1CCCC1=O
InChI Key InChIKey=NLSNSOOHLJWWBV-DYIKCSJPSA-N
Data  3 IC50
  Tab Delimited (TSV)   2D SDfile   Computed 3D by Vconf -m prep SDfile
Find this compound or compounds like it in BindingDB:
Activity Spreadsheet -- Enzyme Inhibition Constant Data from BindingDB
Found 3 hits for monomerid = 50231692
TargetBeta-secretase 1(Homo sapiens (Human))
Glaxosmithkline
Curated by ChEMBL
LigandPNGBDBM50231692(CHEMBL252495 | N-((2S,3R)-4-((R)-2,3-dihydro-1H-in...)
Affinity DataIC50:  3.47E+4nM. Assay description: Inhibition of BACE1
In DepthDetails ArticlePubMed
TargetCathepsin D(Homo sapiens (Human))
Glaxosmithkline
Curated by ChEMBL
LigandPNGBDBM50231692(CHEMBL252495 | N-((2S,3R)-4-((R)-2,3-dihydro-1H-in...)
Affinity DataIC50:  1.02E+4nM. Assay description: Inhibition of cathepsin D
In DepthDetails ArticlePubMed
TargetBeta-secretase 2(Homo sapiens (Human))
Glaxosmithkline
Curated by ChEMBL
LigandPNGBDBM50231692(CHEMBL252495 | N-((2S,3R)-4-((R)-2,3-dihydro-1H-in...)
Affinity DataIC50:  9.33E+4nM. Assay description: Inhibition of BACE2
In DepthDetails ArticlePubMed