BDBM50231935 (2,5-dimethyloxazol-4-yl)methyl (R)-1-((2S,3R)-4-(3-methoxybenzylamino)-3-hydroxy-1-phenylbutan-2-ylamino)-3-(methylsulfonyl)-1-oxopropan-2-ylcarbamate::CHEMBL252910
SMILES COc1cccc(CNC[C@@H](O)[C@H](Cc2ccccc2)NC(=O)[C@H](CS(C)(=O)=O)NC(=O)OCc2nc(C)oc2C)c1
InChI Key InChIKey=AQVZMNPLRDUERC-DOEKTCAHSA-N
Data  1 KI
  Tab Delimited (TSV)   2D SDfile   Computed 3D by Vconf -m prep SDfile
Find this compound or compounds like it in BindingDB:
Activity Spreadsheet -- Enzyme Inhibition Constant Data from BindingDB
Found 1 hit for monomerid = 50231935
TargetBeta-secretase 1(Homo sapiens (Human))
Purdue University
Curated by ChEMBL
LigandPNGBDBM50231935((2,5-dimethyloxazol-4-yl)methyl (R)-1-((2S,3R)-4-(...)
Affinity DataKi:  1.50E+4nM. Assay description: Binding affinity to recombinant memapsin 2
In DepthDetails ArticlePubMed