BDBM50232128 1-(1H-Indazol-4-yl)-3-(5-fluoro-4-morpholin-1-yl-indan-1-yl)-urea::CHEMBL399638
SMILES Fc1ccc2C(CCc2c1N1CCOCC1)NC(=O)Nc1cccc2[nH]ncc12
InChI Key InChIKey=JYYDBVOVDJIMDV-UHFFFAOYSA-N
Data  1 IC50
  Tab Delimited (TSV)   2D SDfile   Computed 3D by Vconf -m prep SDfile
Find this compound or compounds like it in BindingDB:
Activity Spreadsheet -- Enzyme Inhibition Constant Data from BindingDB
Found 1 hit for monomerid = 50232128
TargetTransient receptor potential cation channel subfamily V member 1(Homo sapiens (Human))
Abbott Laboratories
Curated by ChEMBL
LigandPNGBDBM50232128(1-(1H-Indazol-4-yl)-3-(5-fluoro-4-morpholin-1-yl-i...)
Affinity DataIC50:  5nM. Assay description: Blockade of human TRPV1 receptor assessed as inhibition of capsaicin-induced calcium flux
In DepthDetails ArticlePubMed