BDBM50232291 (R)-N-((5-(2-(1H-indol-3-yl)ethyl)-4-(4-methoxybenzyl)-4H-1,2,4-triazol-3-yl)(1H-indol-3-yl)methyl)-2-(pyridin-4-yl)acetamide::CHEMBL414930
SMILES COc1ccc(Cn2c(CCc3c[nH]c4ccccc34)nnc2[C@H](NC(=O)Cc2ccncc2)c2c[nH]c3ccccc23)cc1
InChI Key InChIKey=UZYFEJDKWKHRKF-PGUFJCEWSA-N
Data  1 IC50
  Tab Delimited (TSV)   2D SDfile   Computed 3D by Vconf -m prep SDfile
Find this compound or compounds like it in BindingDB:
Activity Spreadsheet -- Enzyme Inhibition Constant Data from BindingDB
Found 1 hit for monomerid = 50232291
TargetGrowth hormone secretagogue receptor type 1(Homo sapiens (Human))
University Of Montpellier
Curated by ChEMBL
LigandPNGBDBM50232291((R)-N-((5-(2-(1H-indol-3-yl)ethyl)-4-(4-methoxyben...)
Affinity DataIC50:  76nM. Assay description: Displacement of 125I-His9-ghrelin from human GHSR1a expressed in LLCPK1 cells
In DepthDetails ArticlePubMed