BDBM50232541 (3-chlorophenyl)(4-((2,4-diaminoquinazolin-5-yloxy)methyl)piperidin-1-yl)methanone::CHEMBL413990
SMILES Nc1nc(N)c2c(OCC3CCN(CC3)C(=O)c3cccc(Cl)c3)cccc2n1
InChI Key InChIKey=QJFHCKIQJMEGEY-UHFFFAOYSA-N
Data  1 IC50
  Tab Delimited (TSV)   2D SDfile   Computed 3D by Vconf -m prep SDfile
Find this compound or compounds like it in BindingDB:
Activity Spreadsheet -- Enzyme Inhibition Constant Data from BindingDB
Found 1 hit for monomerid = 50232541
TargetDihydrofolate reductase(Homo sapiens (Human))
Decode Chemistry
Curated by ChEMBL
LigandPNGBDBM50232541((3-chlorophenyl)(4-((2,4-diaminoquinazolin-5-yloxy...)
Affinity DataIC50: >1.25E+5nM. Assay description: Inhibition of human recombinant DHFR
In DepthDetails ArticlePubMed