BDBM50232706 CHEMBL4068690::US11046670, Table 6.2
SMILES [H][C@]12C[C@@]([H])(N(CC1)C(=O)OCc1ccccc1)c1cc(ccc21)N1CCN(CC1)C1CCCC1
InChI Key InChIKey=QAFQNYQSHKJJPP-AJTFRIOCSA-N
Data  6 KI
  Tab Delimited (TSV)   2D SDfile   Computed 3D by Vconf -m prep SDfile
Find this compound or compounds like it in BindingDB:
Activity Spreadsheet -- Enzyme Inhibition Constant Data from BindingDB
Found 6 hits for monomerid = 50232706
TargetSigma intracellular receptor 2(Homo sapiens (Human))
Board Of Regents, The University Of Texas System
US Patent
LigandPNGBDBM50232706(CHEMBL4068690 | US11046670, Table 6.2)
Affinity DataKi:  2.30nM
In DepthDetails US Patent
TargetSigma intracellular receptor 2(Homo sapiens (Human))
Board Of Regents, The University Of Texas System
US Patent
LigandPNGBDBM50232706(CHEMBL4068690 | US11046670, Table 6.2)
Affinity DataKi:  2.30nM
In DepthDetails US Patent
TargetSigma intracellular receptor 2(Rattus norvegicus (Rat))
The University Of Texas At Austin
Curated by ChEMBL
LigandPNGBDBM50232706(CHEMBL4068690 | US11046670, Table 6.2)
Affinity DataKi:  3.60nM. Assay description: Displacement of [3H]-ditolylguanidine from sigma2 receptor in rat PC12 cells in presence of (+)-pentazocine by PDSP assay
In DepthDetails ArticlePubMed
TargetSigma non-opioid intracellular receptor 1(Cavia porcellus (Guinea pig))
The University Of Texas At Austin
Curated by ChEMBL
LigandPNGBDBM50232706(CHEMBL4068690 | US11046670, Table 6.2)
Affinity DataKi:  130nM. Assay description: Displacement of [3H]-(+)-pentazocine from guinea pig brain sigma1 receptor by PDSP assay
In DepthDetails ArticlePubMed
TargetSigma non-opioid intracellular receptor 1(Homo sapiens (Human))
Board Of Regents, The University Of Texas System
US Patent
LigandPNGBDBM50232706(CHEMBL4068690 | US11046670, Table 6.2)
Affinity DataKi:  170nM. Assay description: Receptor binding assays were performed by the Psychoactive Drug Screening Program (PDSP) at Chapel Hill, N.C. The assay protocol book can be accessed...
In DepthDetails US Patent
TargetSigma non-opioid intracellular receptor 1(Homo sapiens (Human))
Board Of Regents, The University Of Texas System
US Patent
LigandPNGBDBM50232706(CHEMBL4068690 | US11046670, Table 6.2)
Affinity DataKi:  170nM. Assay description: Receptor binding assays were performed by the Psychoactive Drug Screening Program (PDSP) at Chapel Hill, N.C. The assay protocol book can be accessed...
In DepthDetails US Patent