BDBM50232772 CHEMBL1625333
SMILES COCCNCCOc1ccccc1-c1ccccc1
InChI Key InChIKey=WFZOYRZOOJWIEL-UHFFFAOYSA-N
Data  1 KI
  Tab Delimited (TSV)   2D SDfile   Computed 3D by Vconf -m prep SDfile
Find this compound or compounds like it in BindingDB:
Activity Spreadsheet -- Enzyme Inhibition Constant Data from BindingDB
Found 1 hit for monomerid = 50232772
TargetBeta-2 adrenergic receptor(Homo sapiens (Human))
Philipps University Marburg
Curated by ChEMBL
LigandPNGBDBM50232772(CHEMBL1625333)
Affinity DataKi:  9nM. Assay description: Displacement of [3H]DHA from beta2-AR (unknown origin) expressed in baculovirus infected sf9 cell membranes after 1 hr by scintillation counting meth...
In DepthDetails ArticlePubMed