BDBM50233690 4-(3-bromo-benzenesulfonyl)-5-methylsulfanyl-thiophene-2-carboxamidine::CHEMBL398527
SMILES CSc1sc(cc1S(=O)(=O)c1cccc(Br)c1)C(N)=N
InChI Key InChIKey=ZNRJWLLKRMWGGV-UHFFFAOYSA-N
Data  1 KI
  Tab Delimited (TSV)   2D SDfile   Computed 3D by Vconf -m prep SDfile
Find this compound or compounds like it in BindingDB:
Activity Spreadsheet -- Enzyme Inhibition Constant Data from BindingDB
Found 1 hit for monomerid = 50233690
TargetComplement C1s subcomponent(Homo sapiens (Human))
Johnson & Johnson Pharmaceutical Research And Development
Curated by ChEMBL
LigandPNGBDBM50233690(4-(3-bromo-benzenesulfonyl)-5-methylsulfanyl-thiop...)
Affinity DataKi:  360nM. Assay description: Inhibition of Complement C1s subcomponent
In DepthDetails ArticlePubMed