BDBM50233730 (2R,4S,5R)-5-((1R,2R)-1-acetamido-2-hydroxypentyl)-4-(prop-1-enyl)pyrrolidine-2-carboxylic acid::CHEMBL253409
SMILES CCC[C@@H](O)[C@H](NC(C)=O)[C@@H]1N[C@H](C[C@H]1\C=C/C)C(O)=O
InChI Key InChIKey=YXHCAKPZTQMYPQ-NCCYUHJHSA-N
Data  1 KI
  Tab Delimited (TSV)   2D SDfile   Computed 3D by Vconf -m prep SDfile
Find this compound or compounds like it in BindingDB:
Activity Spreadsheet -- Enzyme Inhibition Constant Data from BindingDB
Found 1 hit for monomerid = 50233730
TargetNeuraminidase(Influenza B virus (B/Lee/40))
Abbott Laboratories
Curated by ChEMBL
LigandPNGBDBM50233730((2R,4S,5R)-5-((1R,2R)-1-acetamido-2-hydroxypentyl)...)
Affinity DataKi:  28nM. Assay description: Inhibition of influenza B/Memphis/3/89 neuraminidase
In DepthDetails ArticlePubMed