BDBM50233732 (2R,4S,5R)-5-((1R,2S)-1-acetamido-2-hydroxypent-4-enyl)-4-(prop-1-enyl)pyrrolidine-2-carboxylic acid::CHEMBL253625
SMILES C\C=C/[C@@H]1C[C@@H](N[C@H]1[C@@H](NC(C)=O)[C@@H](O)CC=C)C(O)=O
InChI Key InChIKey=ZOAKLQMVBDHVRI-SZUUGEOJSA-N
Data  1 KI
  Tab Delimited (TSV)   2D SDfile   Computed 3D by Vconf -m prep SDfile
Find this compound or compounds like it in BindingDB:
Activity Spreadsheet -- Enzyme Inhibition Constant Data from BindingDB
Found 1 hit for monomerid = 50233732
TargetNeuraminidase(Influenza B virus (B/Lee/40))
Abbott Laboratories
Curated by ChEMBL
LigandPNGBDBM50233732((2R,4S,5R)-5-((1R,2S)-1-acetamido-2-hydroxypent-4-...)
Affinity DataKi:  1.60nM. Assay description: Inhibition of influenza B/Memphis/3/89 neuraminidase
In DepthDetails ArticlePubMed