BDBM50234092 CHEMBL4073637
SMILES Cl.OC(=O)[C@@H]1C[C@H](CN1)Oc1cccc(c1)C(O)=O
InChI Key InChIKey=IWNYVPCMSYWACS-UXQCFNEQSA-N
Data  4 KI  3 IC50
  Tab Delimited (TSV)   2D SDfile   Computed 3D by Vconf -m prep SDfile
Find this compound or compounds like it in BindingDB:
Activity Spreadsheet -- Enzyme Inhibition Constant Data from BindingDB
Found 7 hits for monomerid = 50234092
TargetGlutamate receptor ionotropic, kainate 1(RAT)
Mcgill University
Curated by ChEMBL
LigandPNGBDBM50234092(CHEMBL4073637)
Affinity DataKi:  3.31E+4nM. Assay description: Displacement of [3H]NF608 from eGFP-fused recombinant rat full length GluK1 receptor expressed in HEK293T/17 cells by liquid scintillation counting m...
In DepthDetails ArticlePubMed
TargetGlutamate receptor ionotropic, kainate 1(RAT)
Mcgill University
Curated by ChEMBL
LigandPNGBDBM50234092(CHEMBL4073637)
Affinity DataKi:  3.60E+4nM. Assay description: Displacement of [3H]NF608 from eGFP-fused recombinant rat full length GluK1 receptor expressed in HEK293T/17 cells by liquid scintillation counting m...
In DepthDetails ArticlePubMed
TargetGlutamate receptor ionotropic, kainate 2(Rattus norvegicus)
Mcgill University
Curated by ChEMBL
LigandPNGBDBM50234092(CHEMBL4073637)
Affinity DataKi: >1.00E+5nM. Assay description: Displacement of [3H]kainic acid from eGFP-fused recombinant rat full length GluK2 receptor expressed in HEK293T/17 cells by liquid scintillation coun...
In DepthDetails ArticlePubMed
TargetGlutamate receptor ionotropic, kainate 3(Rattus norvegicus)
Mcgill University
Curated by ChEMBL
LigandPNGBDBM50234092(CHEMBL4073637)
Affinity DataKi: >1.00E+6nM. Assay description: Displacement of [3H]kainic acid from eGFP-fused recombinant rat full length GluK3 receptor expressed in HEK293T/17 cells by liquid scintillation coun...
In DepthDetails ArticlePubMed
TargetExcitatory amino acid transporter 2(Homo sapiens (Human))
Mcgill University
Curated by ChEMBL
LigandPNGBDBM50234092(CHEMBL4073637)
Affinity DataIC50: >1.00E+6nM. Assay description: Inhibition of human EAAT2 expressed in HEK293 cells assessed as reduction in [3H]-D-Asp uptake after 15 mins by TopCount scintillation counting metho...
In DepthDetails ArticlePubMed
TargetExcitatory amino acid transporter 1(Homo sapiens (Human))
Mcgill University
Curated by ChEMBL
LigandPNGBDBM50234092(CHEMBL4073637)
Affinity DataIC50: >1.00E+6nM. Assay description: Inhibition of human EAAT1 expressed in HEK293 cells assessed as reduction in [3H]-D-Asp uptake after 15 mins by TopCount scintillation counting metho...
In DepthDetails ArticlePubMed
TargetExcitatory amino acid transporter 3(Homo sapiens (Human))
Mcgill University
Curated by ChEMBL
LigandPNGBDBM50234092(CHEMBL4073637)
Affinity DataIC50: >1.00E+6nM. Assay description: Inhibition of human EAAT3 expressed in HEK293 cells assessed as reduction in [3H]-D-Asp uptake after 15 mins by TopCount scintillation counting metho...
In DepthDetails ArticlePubMed