BDBM50234096 CHEMBL4084004
SMILES OC(=O)[C@@H]1C[C@H](CN1)Sc1ccccc1C(O)=O
InChI Key InChIKey=YPBDKMOKCCZSBI-APPZFPTMSA-N
Data  5 KI
  Tab Delimited (TSV)   2D SDfile   Computed 3D by Vconf -m prep SDfile
Find this compound or compounds like it in BindingDB:
Activity Spreadsheet -- Enzyme Inhibition Constant Data from BindingDB
Found 5 hits for monomerid = 50234096
TargetGlutamate receptor ionotropic, kainate 1(RAT)
Mcgill University
Curated by ChEMBL
LigandPNGBDBM50234096(CHEMBL4084004)
Affinity DataKi:  7.94E+3nM. Assay description: Displacement of [3H]NF608 from eGFP-fused recombinant rat full length GluK1 receptor expressed in HEK293T/17 cells by liquid scintillation counting m...
In DepthDetails ArticlePubMed
TargetGlutamate receptor ionotropic, kainate 1(RAT)
Mcgill University
Curated by ChEMBL
LigandPNGBDBM50234096(CHEMBL4084004)
Affinity DataKi:  8.40E+3nM. Assay description: Displacement of [3H]NF608 from eGFP-fused recombinant rat full length GluK1 receptor expressed in HEK293T/17 cells by liquid scintillation counting m...
In DepthDetails ArticlePubMed
TargetGlutamate receptor ionotropic, kainate 3(Rattus norvegicus)
Mcgill University
Curated by ChEMBL
LigandPNGBDBM50234096(CHEMBL4084004)
Affinity DataKi:  2.19E+4nM. Assay description: Displacement of [3H]kainic acid from eGFP-fused recombinant rat full length GluK3 receptor expressed in HEK293T/17 cells by liquid scintillation coun...
In DepthDetails ArticlePubMed
TargetGlutamate receptor ionotropic, kainate 3(Rattus norvegicus)
Mcgill University
Curated by ChEMBL
LigandPNGBDBM50234096(CHEMBL4084004)
Affinity DataKi:  2.20E+4nM. Assay description: Displacement of [3H]kainic acid from eGFP-fused recombinant rat full length GluK3 receptor expressed in HEK293T/17 cells by liquid scintillation coun...
In DepthDetails ArticlePubMed
TargetGlutamate receptor ionotropic, kainate 2(Rattus norvegicus)
Mcgill University
Curated by ChEMBL
LigandPNGBDBM50234096(CHEMBL4084004)
Affinity DataKi: >1.00E+5nM. Assay description: Displacement of [3H]kainic acid from eGFP-fused recombinant rat full length GluK2 receptor expressed in HEK293T/17 cells by liquid scintillation coun...
In DepthDetails ArticlePubMed