BDBM50234185 CHEMBL4072048
SMILES COc1cc(ccc1Nc1ncc2c(C)cc(=O)n(-c3cccc(NC(=O)C=C)c3)c2n1)N1CC(C)N(C)C(C)C1
InChI Key InChIKey=PRYBDIYFEXNDDP-UHFFFAOYSA-N
Data  1 IC50
  Tab Delimited (TSV)   2D SDfile   Computed 3D by Vconf -m prep SDfile
Find this compound or compounds like it in BindingDB:
Activity Spreadsheet -- Enzyme Inhibition Constant Data from BindingDB
Found 1 hit for monomerid = 50234185
TargetEpidermal growth factor receptor(Homo sapiens (Human))
Guangzhou Institutes Of Biomedicine And Health
Curated by ChEMBL
LigandPNGBDBM50234185(CHEMBL4072048)
Affinity DataIC50:  97nM. Assay description: Inhibition of N-terminal 6His/TEV protease cleavage site-tagged wild type human EGFR using poly (Glu,Tyr) 4:1 as substrate after 1 hr by ELISA
In DepthDetails ArticlePubMed