BDBM50234651 4,6-dinitrobenzene-1,2,3-triol::CHEMBL400737
SMILES Oc1c(O)c(cc(c1O)[N+]([O-])=O)[N+]([O-])=O
InChI Key InChIKey=JJPIRJNQXIJGPL-UHFFFAOYSA-N
Data  1 IC50
  Tab Delimited (TSV)   2D SDfile   Computed 3D by Vconf -m prep SDfile
Find this compound or compounds like it in BindingDB:
Activity Spreadsheet -- Enzyme Inhibition Constant Data from BindingDB
Found 1 hit for monomerid = 50234651
TargetAutoinducer 2-binding periplasmic protein LuxP(Vibrio harveyi)
Georgia State University
Curated by ChEMBL
LigandPNGBDBM50234651(4,6-dinitrobenzene-1,2,3-triol | CHEMBL400737)
Affinity DataIC50:  3.00E+3nM. Assay description: Antagonist activity at LuxP receptor in Vibrio harveyi MM32 assessed as inhibition of autoinducer2-mediated quorum sensing after 3 to 4 hrs
In DepthDetails ArticlePubMed