BDBM50234703 CHEMBL4104578
SMILES CCc1ccc(cc1)-c1c(-c2ccc(C)cc2)n(Cc2ccc(OC)cc2)c2ccc(cc2c1=O)[N+]([O-])=O
InChI Key InChIKey=IJGZSDZNKYLJDT-UHFFFAOYSA-N
Data  2 IC50
  Tab Delimited (TSV)   2D SDfile   Computed 3D by Vconf -m prep SDfile
Find this compound or compounds like it in BindingDB:
Activity Spreadsheet -- Enzyme Inhibition Constant Data from BindingDB
Found 2 hits for monomerid = 50234703
TargetIntestinal-type alkaline phosphatase(Bos taurus (Cattle))
Universit£T Rostock
Curated by ChEMBL
LigandPNGBDBM50234703(CHEMBL4104578)
Affinity DataIC50:  5.75E+3nM. Assay description: Inhibition of calf intestinal alkaline phosphatase using CDP-star as substrate preincubated for 5 to 7 mins followed by substrate addition measured a...
In DepthDetails ArticlePubMed
TargetAlkaline phosphatase, tissue-nonspecific isozyme(Bos taurus (Cattle))
Universit£T Rostock
Curated by ChEMBL
LigandPNGBDBM50234703(CHEMBL4104578)
Affinity DataIC50:  1.66E+3nM. Assay description: Inhibition of bovine TNAP using CDP-star as substrate preincubated for 5 to 7 mins followed by substrate addition measured after 15 mins by spectroph...
In DepthDetails ArticlePubMed