BDBM50235527 CHEMBL535639::N-(4-carbamimidoylbenzyl)-2-(4-methyl-2-oxo-1-(phenethylamino)-1,2-dihydropyridin-3-yl)acetamide hydrochloride
SMILES Cc1ccn(NCCc2ccccc2)c(=O)c1CC(=O)NCc1ccc(cc1)C(N)=N
InChI Key InChIKey=WWGXYHGOXMYFCH-UHFFFAOYSA-N
Data  1 IC50
  Tab Delimited (TSV)   2D SDfile   Computed 3D by Vconf -m prep SDfile
Find this compound or compounds like it in BindingDB:
Activity Spreadsheet -- Enzyme Inhibition Constant Data from BindingDB
Found 1 hit for monomerid = 50235527
TargetProthrombin(Homo sapiens (Human))
Universit£
Curated by ChEMBL
LigandPNGBDBM50235527(CHEMBL535639 | N-(4-carbamimidoylbenzyl)-2-(4-meth...)
Affinity DataIC50:  91nM. Assay description: Inhibition of thrombin
In DepthDetails ArticlePubMed