BDBM50235543 2-fluoro-N-(3-fluoro-4-(5-methyl-6-(2-(4-methylpiperazin-1-yl)ethoxy)pyrrolo[1,2-f][1,2,4]triazin-4-yloxy)phenyl)benzamide::CHEMBL254879
SMILES CN1CCN(CCOc2cn3ncnc(Oc4ccc(NC(=O)c5ccccc5F)cc4F)c3c2C)CC1
InChI Key InChIKey=XVHNAGNSEXZDNC-UHFFFAOYSA-N
Data  2 IC50
  Tab Delimited (TSV)   2D SDfile   Computed 3D by Vconf -m prep SDfile
Find this compound or compounds like it in BindingDB:
Activity Spreadsheet -- Enzyme Inhibition Constant Data from BindingDB
Found 2 hits for monomerid = 50235543
TargetHepatocyte growth factor receptor(Homo sapiens (Human))
Sichuan University
Curated by ChEMBL
LigandPNGBDBM50235543(2-fluoro-N-(3-fluoro-4-(5-methyl-6-(2-(4-methylpip...)
Affinity DataIC50:  90nM. Assay description: Inhibition of human c-MET
In DepthDetails ArticlePubMed
TargetHepatocyte growth factor receptor(Homo sapiens (Human))
Sichuan University
Curated by ChEMBL
LigandPNGBDBM50235543(2-fluoro-N-(3-fluoro-4-(5-methyl-6-(2-(4-methylpip...)
Affinity DataIC50:  90nM. Assay description: Inhibition of human recombinant c-Met expressed in insect cell-baculovirus expression system
In DepthDetails ArticlePubMed