BDBM50235740 CHEMBL4061441
SMILES CC(C)c1ccc2cc([nH]c2c1F)C(O)=O
InChI Key InChIKey=RWVDYXCOBZNVGG-UHFFFAOYSA-N
Data  2 IC50
  Tab Delimited (TSV)   2D SDfile   Computed 3D by Vconf -m prep SDfile
Find this compound or compounds like it in BindingDB:
Activity Spreadsheet -- Enzyme Inhibition Constant Data from BindingDB
Found 2 hits for monomerid = 50235740
TargetEukaryotic initiation factor 4A-III(Homo sapiens (Human))
Takeda Pharmaceutical
Curated by ChEMBL
LigandPNGBDBM50235740(CHEMBL4061441)
Affinity DataIC50:  6.90E+3nM. Assay description: Antagonism of batrachotoxin-mediated sodium ion uptake into cultured neuroblastoma cells
In DepthDetails ArticlePubMed
TargetEukaryotic initiation factor 4A-I(Homo sapiens (Human))
Takeda Pharmaceutical
Curated by ChEMBL
LigandPNGBDBM50235740(CHEMBL4061441)
Affinity DataIC50: >1.00E+5nM. Assay description: Inhibition of eIF4G-induced full length recombinant human N-terminal His6/SUMO-tagged eIF4A1 RNA dependent ATPase activity expressed in Escherichia c...
In DepthDetails ArticlePubMed