BDBM50236087 CHEMBL4079601
SMILES CNc1nc(Nc2ccc(C)c(NC(=O)C=C)c2)ncc1C(=O)Nc1cc(NC(=O)c2ccc3OCCOc3c2)ccc1C
InChI Key InChIKey=QDXRJXIJDJROFX-UHFFFAOYSA-N
Data  1 IC50
  Tab Delimited (TSV)   2D SDfile   Computed 3D by Vconf -m prep SDfile
Find this compound or compounds like it in BindingDB:
Activity Spreadsheet -- Enzyme Inhibition Constant Data from BindingDB
Found 1 hit for monomerid = 50236087
TargetCytoplasmic tyrosine-protein kinase BMX(Homo sapiens (Human))
High Magnetic Field Laboratory
Curated by ChEMBL
LigandPNGBDBM50236087(CHEMBL4079601)
Affinity DataIC50:  279nM. Assay description: Inhibition of full-length recombinant human His-tagged BMX expressed in baculovirus expression system using Poly(4:1 Glu, Tyr) as substrate after 1 h...
In DepthDetails ArticlePubMed