BDBM50236152 4'-{2-[(R)-2-(3-Chloro-phenyl)-2-hydroxy-ethylamino]-ethyl}-biphenyl-4-carboxylic acid::4-(2-{[(2R)-2-(3-chlorophenyl)-2-hydroxyethyl]amino}ethyl)-4-biphenyl-4-carboxylic acid::CHEMBL271576
SMILES O[C@@H](CNCCc1ccc(cc1)-c1ccc(cc1)C(O)=O)c1cccc(Cl)c1
InChI Key InChIKey=OBZHPIBYGAZXEL-QFIPXVFZSA-N
Data  8 EC50
  Tab Delimited (TSV)   2D SDfile   Computed 3D by Vconf -m prep SDfile
Find this compound or compounds like it in BindingDB:
Activity Spreadsheet -- Enzyme Inhibition Constant Data from BindingDB
Found 8 hits for monomerid = 50236152
TargetBeta-2 adrenergic receptor(Homo sapiens (Human))
Astellas Pharma
Curated by ChEMBL
LigandPNGBDBM50236152(4'-{2-[(R)-2-(3-Chloro-phenyl)-2-hydroxy-ethylamin...)
Affinity DataEC50: >1.00E+3nM. Assay description: Agonist activity at human beta2 adrenergic receptor expressed in CHO cells assessed as cAMP accumulation
In DepthDetails ArticlePubMed
TargetBeta-2 adrenergic receptor(Homo sapiens (Human))
Astellas Pharma
Curated by ChEMBL
LigandPNGBDBM50236152(4'-{2-[(R)-2-(3-Chloro-phenyl)-2-hydroxy-ethylamin...)
Affinity DataEC50: >1.00E+4nM. Assay description: Agonist activity at human beta2 adrenergic receptor expressed in CHO cells assessed as cAMP accumulation by EIA
In DepthDetails ArticlePubMed
TargetBeta-3 adrenergic receptor(Homo sapiens (Human))
Astellas Pharma
Curated by ChEMBL
LigandPNGBDBM50236152(4'-{2-[(R)-2-(3-Chloro-phenyl)-2-hydroxy-ethylamin...)
Affinity DataEC50:  6.70nM. Assay description: Agonist activity at human cloned adrenergic beta3 receptor expressed in CHO cells assessed as cAMP accumulation
In DepthDetails ArticlePubMed
TargetBeta-1 adrenergic receptor(Homo sapiens (Human))
Astellas Pharma
Curated by ChEMBL
LigandPNGBDBM50236152(4'-{2-[(R)-2-(3-Chloro-phenyl)-2-hydroxy-ethylamin...)
Affinity DataEC50:  280nM. Assay description: Agonist activity at human cloned beta-1 adrenergic receptor expressed in CHO cells assessed as cAMP accumulation
In DepthDetails ArticlePubMed
TargetBeta-3 adrenergic receptor(Homo sapiens (Human))
Astellas Pharma
Curated by ChEMBL
LigandPNGBDBM50236152(4'-{2-[(R)-2-(3-Chloro-phenyl)-2-hydroxy-ethylamin...)
Affinity DataEC50:  6.70nM. Assay description: Agonist activity at human beta3 adrenergic receptor expressed in CHO cells assessed as cAMP accumulation by EIA
In DepthDetails ArticlePubMed
TargetBeta-1 adrenergic receptor(Homo sapiens (Human))
Astellas Pharma
Curated by ChEMBL
LigandPNGBDBM50236152(4'-{2-[(R)-2-(3-Chloro-phenyl)-2-hydroxy-ethylamin...)
Affinity DataEC50:  280nM. Assay description: Agonist activity at human beta-1 adrenergic receptor expressed in CHO cells assessed as cAMP accumulation by EIA
In DepthDetails ArticlePubMed
TargetBeta-3 adrenergic receptor(Homo sapiens (Human))
Astellas Pharma
Curated by ChEMBL
LigandPNGBDBM50236152(4'-{2-[(R)-2-(3-Chloro-phenyl)-2-hydroxy-ethylamin...)
Affinity DataEC50:  6.70nM. Assay description: Agonist activity at human cloned beta3 adrenergic receptor expressed in CHO cells assessed as cAMP accumulation
In DepthDetails ArticlePubMed
TargetBeta-1 adrenergic receptor(Homo sapiens (Human))
Astellas Pharma
Curated by ChEMBL
LigandPNGBDBM50236152(4'-{2-[(R)-2-(3-Chloro-phenyl)-2-hydroxy-ethylamin...)
Affinity DataEC50:  280nM. Assay description: Agonist activity at human cloned adrenergic beta1 receptor expressed in CHO cells assessed as cAMP accumulation
In DepthDetails ArticlePubMed