BDBM50236168 (R)-4'-(2-(2-(3-chlorophenyl)-2-hydroxyethylamino)ethyl)-3-(cyclohexyloxy)biphenyl-4-carboxylic acid::4'-{2-[(R)-2-(3-Chloro-phenyl)-2-hydroxy-ethylamino]-ethyl}-3-cyclohexyloxy-biphenyl-4-carboxylic acid::4-(2-{[(2R)-2-(3-chlorophenyl)-2-hydroxyethyl]amino}ethyl)-3-(cyclohexyloxy)-4-biphenylcarboxylic acid::CHEMBL256418
SMILES O[C@@H](CNCCc1ccc(cc1)-c1ccc(C(O)=O)c(OC2CCCCC2)c1)c1cccc(Cl)c1
InChI Key InChIKey=RWAABJPWMZNDQM-MHZLTWQESA-N
Data  6 EC50
  Tab Delimited (TSV)   2D SDfile   Computed 3D by Vconf -m prep SDfile
Find this compound or compounds like it in BindingDB:
Activity Spreadsheet -- Enzyme Inhibition Constant Data from BindingDB
Found 6 hits for monomerid = 50236168
TargetBeta-3 adrenergic receptor(Homo sapiens (Human))
Astellas Pharma
Curated by ChEMBL
LigandPNGBDBM50236168((R)-4'-(2-(2-(3-chlorophenyl)-2-hydroxyethylamino)...)
Affinity DataEC50:  0.460nM. Assay description: Agonist activity at human recombinant beta3 adrenergic receptor expressed in CHO cells assessed as cAMP accumulation by enzyme immuno assay
In DepthDetails ArticlePubMed
TargetBeta-1 adrenergic receptor(Homo sapiens (Human))
Astellas Pharma
Curated by ChEMBL
LigandPNGBDBM50236168((R)-4'-(2-(2-(3-chlorophenyl)-2-hydroxyethylamino)...)
Affinity DataEC50:  55nM. Assay description: Agonist activity at human recombinant beta-1 adrenergic receptor expressed in CHO cells assessed as cAMP accumulation by enzyme immuno assay
In DepthDetails ArticlePubMed
TargetBeta-3 adrenergic receptor(Homo sapiens (Human))
Astellas Pharma
Curated by ChEMBL
LigandPNGBDBM50236168((R)-4'-(2-(2-(3-chlorophenyl)-2-hydroxyethylamino)...)
Affinity DataEC50:  0.460nM. Assay description: Agonist activity at human beta3 adrenergic receptor expressed in CHO cells assessed as cAMP accumulation by EIA
In DepthDetails ArticlePubMed
TargetBeta-3 adrenergic receptor(Homo sapiens (Human))
Astellas Pharma
Curated by ChEMBL
LigandPNGBDBM50236168((R)-4'-(2-(2-(3-chlorophenyl)-2-hydroxyethylamino)...)
Affinity DataEC50:  0.460nM. Assay description: Agonist activity at human recombinant beta3 adrenergic receptor expressed in CHO cells assessed as cAMP accumulation by enzyme immunoassay
In DepthDetails ArticlePubMed
TargetBeta-1 adrenergic receptor(Homo sapiens (Human))
Astellas Pharma
Curated by ChEMBL
LigandPNGBDBM50236168((R)-4'-(2-(2-(3-chlorophenyl)-2-hydroxyethylamino)...)
Affinity DataEC50:  55nM. Assay description: Agonist activity at human beta-1 adrenergic receptor expressed in CHO cells assessed as cAMP accumulation by EIA
In DepthDetails ArticlePubMed
TargetBeta-1 adrenergic receptor(Homo sapiens (Human))
Astellas Pharma
Curated by ChEMBL
LigandPNGBDBM50236168((R)-4'-(2-(2-(3-chlorophenyl)-2-hydroxyethylamino)...)
Affinity DataEC50:  55nM. Assay description: Agonist activity at human recombinant beta-1 adrenergic receptor expressed in CHO cells assessed as cAMP accumulation by enzyme immunoassay
In DepthDetails ArticlePubMed