BDBM50236261 7-[(1E)-1-(ethoxyimino)-2-methylpropyl]-19-methyl-3,13,19,20-tetraazahexacyclo[14.7.0.0^{2,10}.0^{4,9}.0^{11,15}.0^{17,21}]tricosa-1(16),2(10),4,6,8,11(15),17,20-octaen-14-one::CHEMBL257794
SMILES CCO\N=C(/C(C)C)c1ccc2[nH]c3c4CCc5nn(C)cc5-c4c4C(=O)NCc4c3c2c1
InChI Key InChIKey=YJQJSZIDTDMDQM-BGABXYSRSA-N
Data  2 IC50
  Tab Delimited (TSV)   2D SDfile   Computed 3D by Vconf -m prep SDfile
Find this compound or compounds like it in BindingDB:
Activity Spreadsheet -- Enzyme Inhibition Constant Data from BindingDB
Found 2 hits for monomerid = 50236261
TargetAngiopoietin-1 receptor(Homo sapiens (Human))
Cephalon
Curated by ChEMBL
LigandPNGBDBM50236261(7-[(1E)-1-(ethoxyimino)-2-methylpropyl]-19-methyl-...)
Affinity DataIC50:  92nM. Assay description: Inhibition of human recombinant TIE2 by HTRF assay
In DepthDetails ArticlePubMed
TargetVascular endothelial growth factor receptor 2(Homo sapiens (Human))
Cephalon
Curated by ChEMBL
LigandPNGBDBM50236261(7-[(1E)-1-(ethoxyimino)-2-methylpropyl]-19-methyl-...)
Affinity DataIC50:  23nM. Assay description: Inhibition of human recombinant VEGFR2 by HTRF assay
In DepthDetails ArticlePubMed