BDBM50236913 CHEMBL4065964
SMILES CC(C)CCC(=O)N[C@@H](Cc1ccc(O)cc1)C(=O)N[C@@H](C(C)C)C(=O)N[C@@H](CCCNC(N)=N)C(=O)c1nc2ccccc2s1
InChI Key InChIKey=SMVFTECPEJXGGF-VBOOUTDYSA-N
Data  2 KI
  Tab Delimited (TSV)   2D SDfile   Computed 3D by Vconf -m prep SDfile
Find this compound or compounds like it in BindingDB:
Activity Spreadsheet -- Enzyme Inhibition Constant Data from BindingDB
Found 2 hits for monomerid = 50236913
TargetTransmembrane protease serine 6(Homo sapiens (Human))
Universit£
Curated by ChEMBL
LigandPNGBDBM50236913(CHEMBL4065964)
Affinity DataKi:  6nM. Assay description: Inhibition of recombinant human C-terminal V5-His-tagged matriptase-2 expressed in Drosophila S2 cells using Boc-Gln-Ala-ArgAMC as substrate measured...
In DepthDetails ArticlePubMed
TargetSuppressor of tumorigenicity 14 protein(Homo sapiens (Human))
Universit£
Curated by ChEMBL
LigandPNGBDBM50236913(CHEMBL4065964)
Affinity DataKi:  28nM. Assay description: Inhibition of recombinant human matriptase (596 to 855 residues) expressed in Escherichia coli using Boc-Gln-Ala-ArgAMC as substrate measured for 120...
In DepthDetails ArticlePubMed