BDBM50236968 1-(1-(4-Methoxyphenyl)propan-2-ylidene)-thiosemicarbazide::1-(1-(4-methoxyphenyl)propan-2-ylidene)thiosemicarbazide::CHEMBL401926
SMILES COc1ccc(CC(C)=NNC(N)=S)cc1
InChI Key InChIKey=DFAFQDRMJFXEKJ-UHFFFAOYSA-N
Data  2 IC50
  Tab Delimited (TSV)   2D SDfile   Computed 3D by Vconf -m prep SDfile
Find this compound or compounds like it in BindingDB:
Activity Spreadsheet -- Enzyme Inhibition Constant Data from BindingDB
Found 2 hits for monomerid = 50236968
TargetPolyphenol oxidase 2(Agaricus bisporus (Common mushroom))
Sun Yat-Sen University
Curated by ChEMBL
LigandPNGBDBM50236968(1-(1-(4-Methoxyphenyl)propan-2-ylidene)-thiosemica...)
Affinity DataIC50:  420nM. Assay description: Inhibition of mushroom tyrosinase
In DepthDetails ArticlePubMed
TargetPolyphenol oxidase 2(Agaricus bisporus (Common mushroom))
Sun Yat-Sen University
Curated by ChEMBL
LigandPNGBDBM50236968(1-(1-(4-Methoxyphenyl)propan-2-ylidene)-thiosemica...)
Affinity DataIC50:  420nM. Assay description: Inhibition of mushroom tyrosinase
In DepthDetails ArticlePubMed