BDBM50237103 CHEMBL4063757
SMILES FC(F)(F)c1cc(NC(=S)Nc2ccc3ncnc(Nc4cccc(Br)c4)c3c2)cc(c1)C(F)(F)F
InChI Key InChIKey=OQOMVWMLNCHSRZ-UHFFFAOYSA-N
Data  1 IC50
  Tab Delimited (TSV)   2D SDfile   Computed 3D by Vconf -m prep SDfile
Find this compound or compounds like it in BindingDB:
Activity Spreadsheet -- Enzyme Inhibition Constant Data from BindingDB
Found 1 hit for monomerid = 50237103
TargetEpidermal growth factor receptor(Homo sapiens (Human))
Saarland University
Curated by ChEMBL
LigandPNGBDBM50237103(CHEMBL4063757)
Affinity DataIC50: >150nM. Assay description: Inhibition of human recombinant GST-tagged EGFR (668 to 1210 residues) cytoplasmic domain expressed in baculovirus expression system
In DepthDetails ArticlePubMed