BDBM50237292 CHEMBL4062930
SMILES CCn1cnc(NC(=O)c2cscn2)c1
InChI Key InChIKey=XMNBQOOFLNXBCD-UHFFFAOYSA-N
Data  1 IC50
  Tab Delimited (TSV)   2D SDfile   Computed 3D by Vconf -m prep SDfile
Find this compound or compounds like it in BindingDB:
Activity Spreadsheet -- Enzyme Inhibition Constant Data from BindingDB
Found 1 hit for monomerid = 50237292
TargetMitogen-activated protein kinase kinase kinase 5(Homo sapiens (Human))
Takeda California
Curated by ChEMBL
LigandPNGBDBM50237292(CHEMBL4062930)
Affinity DataIC50:  1.00E+5nM. Assay description: Inhibition of ASK1 (unknown origin) using biotin-MBP as substrate after 20 mins by TR-FRET assay
In DepthDetails ArticlePubMed