BDBM50237608 CHEBI:8064::Phenformin
SMILES NC(=N)NC(=N)NCCc1ccccc1
InChI Key InChIKey=ICFJFFQQTFMIBG-UHFFFAOYSA-N
Data  1 KI  6 IC50
PDB links: 1 PDB ID matches this monomer.
  Tab Delimited (TSV)   2D SDfile   Computed 3D by Vconf -m prep SDfile
Find this compound or compounds like it in BindingDB:
Activity Spreadsheet -- Enzyme Inhibition Constant Data from BindingDB
Found 7 hits for monomerid = 50237608
TargetDihydrofolate reductase(Homo sapiens (Human))
University Of Tennessee
Curated by ChEMBL
LigandPNGBDBM50237608(CHEBI:8064 | Phenformin)
Affinity DataKi:  1.40E+5nM. Assay description: Inhibition of human DHFR in presence of DHF and NADPH by UV-vis spectrometry by Lineweaver-Burk plot analysis
In DepthDetails ArticlePubMed
TargetBile salt export pump(Homo sapiens (Human))
Astrazeneca
Curated by ChEMBL
LigandPNGBDBM50237608(CHEBI:8064 | Phenformin)
Affinity DataIC50: >1.00E+6nM. Assay description: Inhibition of human BSEP expressed in baculovirus transfected fall armyworm Sf21 cell membranes vesicles assessed as reduction in ATP-dependent [3H]-...
In DepthDetails ArticlePubMed
TargetATP-binding cassette sub-family C member 2(Homo sapiens (Human))
Amgen
Curated by ChEMBL
LigandPNGBDBM50237608(CHEBI:8064 | Phenformin)
Affinity DataIC50: >1.33E+5nM. Assay description: Inhibition of human MRP2 overexpressed in Sf9 cell membrane vesicles assessed as uptake of [3H]-estradiol-17beta-D-glucuronide in presence of ATP and...
In DepthDetails ArticlePubMed
TargetATP-binding cassette sub-family C member 4(Homo sapiens (Human))
Amgen
Curated by ChEMBL
LigandPNGBDBM50237608(CHEBI:8064 | Phenformin)
Affinity DataIC50: >1.33E+5nM. Assay description: Inhibition of human MRP4 overexpressed in Sf9 cell membrane vesicles assessed as uptake of [3H]-estradiol-17beta-D-glucuronide in presence of ATP and...
In DepthDetails ArticlePubMed
TargetATP-binding cassette sub-family C member 3(Homo sapiens (Human))
Amgen
Curated by ChEMBL
LigandPNGBDBM50237608(CHEBI:8064 | Phenformin)
Affinity DataIC50: >1.33E+5nM. Assay description: Inhibition of human MRP3 overexpressed in Sf9 insect cell membrane vesicles assessed as uptake of [3H]-estradiol-17beta-D-glucuronide in presence of ...
In DepthDetails ArticlePubMed
TargetBile salt export pump(Homo sapiens (Human))
Astrazeneca
Curated by ChEMBL
LigandPNGBDBM50237608(CHEBI:8064 | Phenformin)
Affinity DataIC50: >1.35E+5nM. Assay description: Inhibition of human BSEP expressed in fall armyworm sf9 cell plasma membrane vesicles assessed as reduction in vesicle-associated [3H]-taurocholate t...
In DepthDetails ArticlePubMed
TargetBile salt export pump(Homo sapiens (Human))
Astrazeneca
Curated by ChEMBL
LigandPNGBDBM50237608(CHEBI:8064 | Phenformin)
Affinity DataIC50: >1.33E+5nM. Assay description: Inhibition of human BSEP overexpressed in Sf9 cell membrane vesicles assessed as uptake of [3H]-taurocholate in presence of ATP measured after 15 to ...
In DepthDetails ArticlePubMed