BDBM50237620 Dihydroethaverine::Dihydroisoperparine::Drotaverine
SMILES CCOc1ccc(\C=C2/NCCc3cc(OCC)c(OCC)cc23)cc1OCC
InChI Key InChIKey=OMFNSKIUKYOYRG-MOSHPQCFSA-N
Data  5 IC50
  Tab Delimited (TSV)   2D SDfile   Computed 3D by Vconf -m prep SDfile
Find this compound or compounds like it in BindingDB:
Activity Spreadsheet -- Enzyme Inhibition Constant Data from BindingDB
Found 5 hits for monomerid = 50237620
TargetBile salt export pump(Homo sapiens (Human))
Amgen
Curated by ChEMBL
LigandPNGBDBM50237620(Dihydroethaverine | Dihydroisoperparine | Drotaver...)
Affinity DataIC50:  3.70E+4nM. Assay description: Inhibition of Cytochrome P450 3A4 with nifedipine
In DepthDetails ArticlePubMed
TargetATP-binding cassette sub-family C member 2(Homo sapiens (Human))
Amgen
Curated by ChEMBL
LigandPNGBDBM50237620(Dihydroethaverine | Dihydroisoperparine | Drotaver...)
Affinity DataIC50: >1.33E+5nM. Assay description: Inhibition of human MRP2 overexpressed in Sf9 cell membrane vesicles assessed as uptake of [3H]-estradiol-17beta-D-glucuronide in presence of ATP and...
In DepthDetails ArticlePubMed
TargetATP-binding cassette sub-family C member 3(Homo sapiens (Human))
Amgen
Curated by ChEMBL
LigandPNGBDBM50237620(Dihydroethaverine | Dihydroisoperparine | Drotaver...)
Affinity DataIC50: >1.33E+5nM. Assay description: Inhibition of human MRP3 overexpressed in Sf9 insect cell membrane vesicles assessed as uptake of [3H]-estradiol-17beta-D-glucuronide in presence of ...
In DepthDetails ArticlePubMed
TargetATP-binding cassette sub-family C member 4(Homo sapiens (Human))
Amgen
Curated by ChEMBL
LigandPNGBDBM50237620(Dihydroethaverine | Dihydroisoperparine | Drotaver...)
Affinity DataIC50:  2.45E+4nM. Assay description: Inhibition of human MRP4 overexpressed in Sf9 cell membrane vesicles assessed as uptake of [3H]-estradiol-17beta-D-glucuronide in presence of ATP and...
In DepthDetails ArticlePubMed
TargetBile salt export pump(Homo sapiens (Human))
Amgen
Curated by ChEMBL
LigandPNGBDBM50237620(Dihydroethaverine | Dihydroisoperparine | Drotaver...)
Affinity DataIC50:  3.70E+4nM. Assay description: Inhibition of human BSEP overexpressed in Sf9 cell membrane vesicles assessed as uptake of [3H]-taurocholate in presence of ATP measured after 15 to ...
In DepthDetails ArticlePubMed