BDBM50237764 CHEMBL4060006
SMILES CN1[C@H]([C@H](c2cccc(Cl)c2F)[C@]2(C(=O)Nc3cc(Cl)ccc23)C11CCCCC1)c1nc(CC(O)=O)cs1
InChI Key InChIKey=WGYXPUUJTJUUMD-ZQIDGUAPSA-N
Data  1 KI  1 IC50
  Tab Delimited (TSV)   2D SDfile   Computed 3D by Vconf -m prep SDfile
Find this compound or compounds like it in BindingDB:
Activity Spreadsheet -- Enzyme Inhibition Constant Data from BindingDB
Found 2 hits for monomerid = 50237764
TargetE3 ubiquitin-protein ligase Mdm2(Homo sapiens (Human))
University Of Michigan Comprehensive Cancer Center
Curated by ChEMBL
LigandPNGBDBM50237764(CHEMBL4060006)
Affinity DataKi:  1nM. Assay description: Inhibition of [3H]-Ro- 15-1788 binding to human GABA-A receptor alpha-5-beta-3-gamma-2 subunits
In DepthDetails ArticlePubMed
TargetE3 ubiquitin-protein ligase Mdm2(Homo sapiens (Human))
University Of Michigan Comprehensive Cancer Center
Curated by ChEMBL
LigandPNGBDBM50237764(CHEMBL4060006)
Affinity DataIC50:  13nM. Assay description: Inhibition of [3H]-Ro- 15-1788 binding to recombinant human gamma-aminobutyric-acid A receptor alpha-3-beta-3-gamma-2
In DepthDetails ArticlePubMed