BDBM50237882 CHEMBL4098383
SMILES COc1ccc(Nc2ncnc3Oc4c(C(c5ccc(OC)cc5)c23)c2ccccc2oc4=O)cc1
InChI Key InChIKey=QCDWKQUBXMFJMD-UHFFFAOYSA-N
Data  1 IC50
  Tab Delimited (TSV)   2D SDfile   Computed 3D by Vconf -m prep SDfile
Find this compound or compounds like it in BindingDB:
Activity Spreadsheet -- Enzyme Inhibition Constant Data from BindingDB
Found 1 hit for monomerid = 50237882
TargetXanthine dehydrogenase/oxidase(Bos taurus (Bovine))
Guru Nanak Dev University
Curated by ChEMBL
LigandPNGBDBM50237882(CHEMBL4098383)
Affinity DataIC50:  2.40E+4nM. Assay description: Inhibition of bovine xanthine oxidase assessed as reduction in uric acid formation using xanthine as substrate pretreated for 5 mins followed by subs...
In DepthDetails ArticlePubMed