BDBM50238676 Aquatag::Benzthiazide::CHEBI:3047::EXNA::Fovane::Urese
SMILES NS(=O)(=O)c1cc2c(cc1Cl)N=C(CSCc1ccccc1)NS2(=O)=O
InChI Key InChIKey=NDTSRXAMMQDVSW-UHFFFAOYSA-N
Data  1 IC50
  Tab Delimited (TSV)   2D SDfile   Computed 3D by Vconf -m prep SDfile
Find this compound or compounds like it in BindingDB:
Activity Spreadsheet -- Enzyme Inhibition Constant Data from BindingDB
Found 1 hit for monomerid = 50238676
TargetBile salt export pump(Homo sapiens (Human))
Astrazeneca
Curated by ChEMBL
LigandPNGBDBM50238676(Aquatag | Benzthiazide | CHEBI:3047 | EXNA | Fovan...)
Affinity DataIC50:  5.74E+4nM. Assay description: Inhibition of human BSEP expressed in baculovirus transfected fall armyworm Sf21 cell membranes vesicles assessed as reduction in ATP-dependent [3H]-...
In DepthDetails ArticlePubMed