BDBM50239041 6-(furan-2-yl)-9H-purin-2-amine::CHEMBL404447
SMILES Nc1nc(-c2ccco2)c2[nH]cnc2n1
InChI Key InChIKey=JZSMPSCWNAYWOI-UHFFFAOYSA-N
Data  4 KI
  Tab Delimited (TSV)   2D SDfile   Computed 3D by Vconf -m prep SDfile
Find this compound or compounds like it in BindingDB:
Activity Spreadsheet -- Enzyme Inhibition Constant Data from BindingDB
Found 4 hits for monomerid = 50239041
TargetAdenosine receptor A2a(Homo sapiens (Human))
Vernalis R&D
Curated by ChEMBL
LigandPNGBDBM50239041(6-(furan-2-yl)-9H-purin-2-amine | CHEMBL404447)
Affinity DataKi:  261nM. Assay description: Displacement of radioligand from human recombinant adenosine A2A receptor at 21 degC after 90 mins by cell-based microplate scintillation counting
In DepthDetails ArticlePubMed
TargetAdenosine receptor A2a(Homo sapiens (Human))
Vernalis R&D
Curated by ChEMBL
LigandPNGBDBM50239041(6-(furan-2-yl)-9H-purin-2-amine | CHEMBL404447)
Affinity DataKi:  261nM. Assay description: Binding affinity at human adenosine A2A receptor
In DepthDetails ArticlePubMed
TargetAdenosine receptor A1(Homo sapiens (Human))
Vernalis (R&D)
Curated by ChEMBL
LigandPNGBDBM50239041(6-(furan-2-yl)-9H-purin-2-amine | CHEMBL404447)
Affinity DataKi:  4.95E+3nM. Assay description: Binding affinity at human adenosine A1 receptor
In DepthDetails ArticlePubMed
TargetAdenosine receptor A1(Homo sapiens (Human))
Vernalis (R&D)
Curated by ChEMBL
LigandPNGBDBM50239041(6-(furan-2-yl)-9H-purin-2-amine | CHEMBL404447)
Affinity DataKi:  4.95E+3nM. Assay description: Displacement of radioligand from human recombinant adenosine A1 receptor at 21 degC after 90 mins by cell-based microplate scintillation counting
In DepthDetails ArticlePubMed