BDBM50239137 CHEMBL4103898
SMILES CS(=O)(=O)Nc1ccncc1-c1ccc(cc1)C#N
InChI Key InChIKey=QUJNEXRPWXLLGU-UHFFFAOYSA-N
Data  1 IC50
  Tab Delimited (TSV)   2D SDfile   Computed 3D by Vconf -m prep SDfile
Find this compound or compounds like it in BindingDB:
Activity Spreadsheet -- Enzyme Inhibition Constant Data from BindingDB
Found 1 hit for monomerid = 50239137
TargetSolute carrier family 22 member 12(Homo sapiens (Human))
Chinese Academy Of Sciences
Curated by ChEMBL
LigandPNGBDBM50239137(CHEMBL4103898)
Affinity DataIC50:  203nM. Assay description: Inhibition of human URAT1 expressed in HEK293T cells assessed as reduction in [14C]uric acid uptake measured after 5 mins by liquid scintillation cou...
In DepthDetails ArticlePubMed