BDBM50239574 CHEMBL4094424
SMILES CCn1c2NC3=C(C(c4ccc(cc4)C(F)(F)F)c2c(=O)[nH]c1=O)C(=O)OC3
InChI Key InChIKey=GSQMKFKPHLJZSN-UHFFFAOYSA-N
Data  2 KI
  Tab Delimited (TSV)   2D SDfile   Computed 3D by Vconf -m prep SDfile
Find this compound or compounds like it in BindingDB:
Activity Spreadsheet -- Enzyme Inhibition Constant Data from BindingDB
Found 2 hits for monomerid = 50239574
TargetBromodomain-containing protein 4(Homo sapiens (Human))
University Of Minnesota
Curated by ChEMBL
LigandPNGBDBM50239574(CHEMBL4094424)
Affinity DataKi:  1.20E+3nM. Assay description: Inhibition of BI-BODIPY binding to BRD4 bromodomain 1 (42 to 168 residues)(unknown origin) expressed in Escherichia coli BL21(DE3) by fluorescence an...
In DepthDetails ArticlePubMed
TargetBromodomain testis-specific protein(Homo sapiens (Human))
University Of Minnesota
Curated by ChEMBL
LigandPNGBDBM50239574(CHEMBL4094424)
Affinity DataKi:  4.70E+3nM. Assay description: Affinity constant of compound was evaluated in human brain
In DepthDetails ArticlePubMed