BDBM50240047 CHEBI:4724::Dyclonine
SMILES CCCCOc1ccc(cc1)C(=O)CCN1CCCCC1
InChI Key InChIKey=BZEWSEKUUPWQDQ-UHFFFAOYSA-N
Data  2 IC50
PDB links: 1 PDB ID matches this monomer.
  Tab Delimited (TSV)   2D SDfile   Computed 3D by Vconf -m prep SDfile
Find this compound or compounds like it in BindingDB:
Activity Spreadsheet -- Enzyme Inhibition Constant Data from BindingDB
Found 2 hits for monomerid = 50240047
TargetAcetylcholinesterase(Homo sapiens (Human))
Prin. K. M. Kundnani College Of Pharmacy
Curated by ChEMBL
LigandPNGBDBM50240047(CHEBI:4724 | Dyclonine)
Affinity DataIC50:  181nM. Assay description: Inhibition of AChE (unknown origin)
In DepthDetails ArticlePubMed
TargetBile salt export pump(Homo sapiens (Human))
Astrazeneca
Curated by ChEMBL
LigandPNGBDBM50240047(CHEBI:4724 | Dyclonine)
Affinity DataIC50:  2.75E+5nM. Assay description: Inhibition of human BSEP expressed in baculovirus transfected fall armyworm Sf21 cell membranes vesicles assessed as reduction in ATP-dependent [3H]-...
In DepthDetails ArticlePubMed