BDBM50240442 CHEMBL33185::N-((1-(4-chlorobenzyl)-4-methoxy-1H-indol-2-yl)methyl)propionamide::N-[1-(4-Chloro-benzyl)-4-methoxy-1H-indol-2-ylmethyl]-propionamide
SMILES CCC(=O)NCc1cc2c(OC)cccc2n1Cc1ccc(Cl)cc1
InChI Key InChIKey=XXXKKZBZKUDKMA-UHFFFAOYSA-N
Data  8 KI
  Tab Delimited (TSV)   2D SDfile   Computed 3D by Vconf -m prep SDfile
Find this compound or compounds like it in BindingDB:
Activity Spreadsheet -- Enzyme Inhibition Constant Data from BindingDB
Found 8 hits for monomerid = 50240442
TargetMelatonin receptor type 1B(Homo sapiens (Human))
Universit£
Curated by ChEMBL
LigandPNGBDBM50240442(CHEMBL33185 | N-((1-(4-chlorobenzyl)-4-methoxy-1H-...)
Affinity DataKi:  8.70nM. Assay description: Inhibition of 2-[125I]iodomelatonin binding to human melatonin receptor MT2 expressed in NIH3T3 rat fibroblast cells
In DepthDetails ArticlePubMed
TargetMelatonin receptor type 1B(Homo sapiens (Human))
Universit£
Curated by ChEMBL
LigandPNGBDBM50240442(CHEMBL33185 | N-((1-(4-chlorobenzyl)-4-methoxy-1H-...)
Affinity DataKi:  8.70nM. Assay description: Antagonist activity at human MT2 receptor
In DepthDetails ArticlePubMed
TargetMelatonin receptor type 1B(Homo sapiens (Human))
Universit£
Curated by ChEMBL
LigandPNGBDBM50240442(CHEMBL33185 | N-((1-(4-chlorobenzyl)-4-methoxy-1H-...)
Affinity DataKi:  8.70nM. Assay description: Binding affinity towards melatonin receptor type 1B stably expressed in NIH3T3 rat fibroblast cells using 2-[125I]iodomelatonin
In DepthDetails ArticlePubMed
TargetMelatonin receptor type 1B(Homo sapiens (Human))
Universit£
Curated by ChEMBL
LigandPNGBDBM50240442(CHEMBL33185 | N-((1-(4-chlorobenzyl)-4-methoxy-1H-...)
Affinity DataKi:  9nM. Assay description: Displacement of 2-[125I]Iodomelatonin from human MT2 receptor expressed in CHO cells
In DepthDetails ArticlePubMed
TargetMelatonin receptor type 1A(Homo sapiens (Human))
Universit£
Curated by ChEMBL
LigandPNGBDBM50240442(CHEMBL33185 | N-((1-(4-chlorobenzyl)-4-methoxy-1H-...)
Affinity DataKi:  1.29E+3nM. Assay description: Binding affinity towards melatonin receptor type 1A stably expressed in NIH3T3 rat fibroblast cells using 2-[125I]iodomelatonin (100 pM) as radioliga...
In DepthDetails ArticlePubMed
TargetMelatonin receptor type 1A(Homo sapiens (Human))
Universit£
Curated by ChEMBL
LigandPNGBDBM50240442(CHEMBL33185 | N-((1-(4-chlorobenzyl)-4-methoxy-1H-...)
Affinity DataKi:  1.29E+3nM. Assay description: Inhibition of 2-[125I]iodomelatonin binding to human melatonin receptor type 1A (MT1) expressed in NIH3T3 rat fibroblast cells
In DepthDetails ArticlePubMed
TargetMelatonin receptor type 1A(Homo sapiens (Human))
Universit£
Curated by ChEMBL
LigandPNGBDBM50240442(CHEMBL33185 | N-((1-(4-chlorobenzyl)-4-methoxy-1H-...)
Affinity DataKi:  1.29E+3nM. Assay description: Displacement of 2-[125I]Iodomelatonin from human MT1 receptor expressed in CHO cells
In DepthDetails ArticlePubMed
TargetMelatonin receptor type 1A(Homo sapiens (Human))
Universit£
Curated by ChEMBL
LigandPNGBDBM50240442(CHEMBL33185 | N-((1-(4-chlorobenzyl)-4-methoxy-1H-...)
Affinity DataKi:  1.29E+3nM. Assay description: Antagonist activity at human MT1 receptor
In DepthDetails ArticlePubMed