BDBM50240500 CHEMBL45763::Methyl-phenethyl-amine::N-methyl-2-phenylelthylamine
SMILES CNCCc1ccccc1
InChI Key InChIKey=SASNBVQSOZSTPD-UHFFFAOYSA-N
Data  3 EC50
  Tab Delimited (TSV)   2D SDfile   Computed 3D by Vconf -m prep SDfile
Find this compound or compounds like it in BindingDB:
Activity Spreadsheet -- Enzyme Inhibition Constant Data from BindingDB
Found 3 hits for monomerid = 50240500
TargetTrace amine-associated receptor 1(Homo sapiens (Human))
Rti International
Curated by ChEMBL
LigandPNGBDBM50240500(CHEMBL45763 | Methyl-phenethyl-amine | N-methyl-2-...)
Affinity DataEC50:  387nM. Assay description: Agonist activity at human trace amine associated receptor 1 expressed in RD-HGA16 CHO-K1 cells coexpressed with Galpha16 protein assessed as internal...
In DepthDetails ArticlePubMed
TargetTrace amine-associated receptor 1(Homo sapiens (Human))
Rti International
Curated by ChEMBL
LigandPNGBDBM50240500(CHEMBL45763 | Methyl-phenethyl-amine | N-methyl-2-...)
Affinity DataEC50:  151nM. Assay description: Agonist activity at recombinant human TAAR1 expressed in CHO-K1 cells assessed as increase in intracellular cAMP incubated for 30 mins by HTRF analys...
In DepthDetails ArticlePubMed
TargetTrace amine-associated receptor 1(Homo sapiens (Human))
Rti International
Curated by ChEMBL
LigandPNGBDBM50240500(CHEMBL45763 | Methyl-phenethyl-amine | N-methyl-2-...)
Affinity DataEC50:  250nM. Assay description: Agonist activity at human trace amine associated receptor 1 expressed in AV12-664 cells coexpressed with rat GalphaS protein assessed as cAMP accumul...
In DepthDetails ArticlePubMed