BDBM50240590 2-(bromomethyl)-6,7-dimethyl-3-phenylquinoxaline::2-Bromomethyl-6,7-dimethyl-3-phenyl-quinoxaline::CHEMBL71884
SMILES Cc1cc2nc(CBr)c(nc2cc1C)-c1ccccc1
InChI Key InChIKey=MMTDBTBWXXXAEZ-UHFFFAOYSA-N
Data  1 IC50
  Tab Delimited (TSV)   2D SDfile   Computed 3D by Vconf -m prep SDfile
Find this compound or compounds like it in BindingDB:
Activity Spreadsheet -- Enzyme Inhibition Constant Data from BindingDB
Found 1 hit for monomerid = 50240590
TargetReceptor tyrosine-protein kinase erbB-2(Homo sapiens (Human))
University Of Southern California
Curated by ChEMBL
LigandPNGBDBM50240590(2-(bromomethyl)-6,7-dimethyl-3-phenylquinoxaline |...)
Affinity DataIC50:  2.10E+4nM. Assay description: Inhibition of HER2 (unknown origin)
In DepthDetails ArticlePubMed