BDBM50240788 2-(2,5-dimethoxy-4-ethylphenyl)ethylamine::2-(4-Ethyl-2,5-dimethoxy-phenyl)-ethylamine::CHEMBL124063
SMILES CCc1cc(OC)c(CCN)cc1OC
InChI Key InChIKey=VDRGNAMREYBIHA-UHFFFAOYSA-N
Data  1 EC50
  Tab Delimited (TSV)   2D SDfile   Computed 3D by Vconf -m prep SDfile
Find this compound or compounds like it in BindingDB:
Activity Spreadsheet -- Enzyme Inhibition Constant Data from BindingDB
Found 1 hit for monomerid = 50240788
TargetTrace amine-associated receptor 1(Homo sapiens (Human))
Rti International
Curated by ChEMBL
LigandPNGBDBM50240788(2-(2,5-dimethoxy-4-ethylphenyl)ethylamine | 2-(4-E...)
Affinity DataEC50:  6.41E+3nM. Assay description: Agonist activity at human trace amine associated receptor 1 expressed in RD-HGA16 CHO-K1 cells coexpressed with Galpha16 protein assessed as internal...
In DepthDetails ArticlePubMed