BDBM50240918 CHEMBL1914996
SMILES O=C1NC(Cc2ccccc2)C(=O)N1
InChI Key InChIKey=DBOMTIHROGSFTI-UHFFFAOYSA-N
Data  1 Kd
PDB links: 1 PDB ID matches this monomer.
  Tab Delimited (TSV)   2D SDfile   Computed 3D by Vconf -m prep SDfile
Find this compound or compounds like it in BindingDB:
Activity Spreadsheet -- Enzyme Inhibition Constant Data from BindingDB
Found 1 hit for monomerid = 50240918
TargetCarbonic anhydrase 2(Homo sapiens (Human))
Griffith University
Curated by ChEMBL
LigandPNGBDBM50240918(CHEMBL1914996)
Affinity DataKd: >2.00E+6nM. Assay description: Binding affinity to human carbonic anhydrase 2 by surface plasmon resonance spectrometry
In DepthDetails ArticlePubMed