BDBM50241154 (Z)-5-(4'-Fluorobenzylidene)-2-thioxothiazolidin-4-one::(Z)-5-(4-fluorobenzyliden)-2-thioxothiazolidin-4-one::CHEMBL387624
SMILES Fc1ccc(C=C2SC(S)=NC2=O)cc1
InChI Key InChIKey=BQOQSIQMDZUHKF-UHFFFAOYSA-N
Data  1 IC50
  Tab Delimited (TSV)   2D SDfile   Computed 3D by Vconf -m prep SDfile
Find this compound or compounds like it in BindingDB:
Activity Spreadsheet -- Enzyme Inhibition Constant Data from BindingDB
Found 1 hit for monomerid = 50241154
TargetArylamine N-acetyltransferase 1(Homo sapiens (Human))
University Of Oxford
Curated by ChEMBL
LigandPNGBDBM50241154((Z)-5-(4'-Fluorobenzylidene)-2-thioxothiazolidin-4...)
Affinity DataIC50:  1.29E+4nM. Assay description: Inhibition of human recombinant NAT1 assessed as hydrolysis of acetyl coA using PABA as substrate by Ellman's method
In DepthDetails ArticlePubMed