BDBM50241478 CHEMBL4092530
SMILES Nc1ccccc1NC(=O)c1ccc(NC(=S)NCc2cccc(F)c2)cc1
InChI Key InChIKey=QDGAIJLWNSWLIL-UHFFFAOYSA-N
Data  2 IC50
  Tab Delimited (TSV)   2D SDfile   Computed 3D by Vconf -m prep SDfile
Find this compound or compounds like it in BindingDB:
Activity Spreadsheet -- Enzyme Inhibition Constant Data from BindingDB
Found 2 hits for monomerid = 50241478
TargetNicotinamide phosphoribosyltransferase(Homo sapiens (Human))
Second Military Medical University
Curated by ChEMBL
LigandPNGBDBM50241478(CHEMBL4092530)
Affinity DataIC50: >2.00E+3nM. Assay description: Inhibition of human recombinant NAMPT using NAM as substrate preincubated for 5 mins followed by substrate addition measured after 15 mins by fluores...
In DepthDetails ArticlePubMed
TargetHistone deacetylase 1(Homo sapiens (Human))
Second Military Medical University
Curated by ChEMBL
LigandPNGBDBM50241478(CHEMBL4092530)
Affinity DataIC50:  170nM. Assay description: Inhibition of human recombinant HDAC1 (1 to 482 residues) expressed in Baculovirus using Ac-Leu-Gly-Lys(Ac)-AMC as substrate preincubated for 5 mins ...
In DepthDetails ArticlePubMed