BDBM50241685 CHEMBL455604::lonchocarpusone
SMILES COc1cc(OC)c(cc1OC)C1COc2c(ccc3OC(C)(C)C=Cc23)C1=O
InChI Key InChIKey=FHQIUPHJETXRLG-UHFFFAOYSA-N
Data  1 IC50
  Tab Delimited (TSV)   2D SDfile   Computed 3D by Vconf -m prep SDfile
Find this compound or compounds like it in BindingDB:
Activity Spreadsheet -- Enzyme Inhibition Constant Data from BindingDB
Found 1 hit for monomerid = 50241685
TargetOrnithine decarboxylase(Homo sapiens (Human))
University Of California
Curated by ChEMBL
LigandPNGBDBM50241685(CHEMBL455604 | lonchocarpusone)
Affinity DataIC50:  2.60E+3nM. Assay description: Inhibition of phorbol ester-induced ornithine decraboxylase in human MCF7 cells after 6 hrs
In DepthDetails ArticlePubMed