BDBM50241687 (2S)-6-(gamma,gamma-dimethylallyl)-5-hydroxy-3',4'-dimethoxy-6'',6''-dimethylpyran[2'',3'':7,8]flavanone::CHEMBL455606
SMILES [#6]-[#8]-c1ccc(cc1-[#8]-[#6])-[#6@@H]-1-[#6]-[#6](=O)-c2c(-[#8])c(-[#6]\[#6]=[#6](\[#6])-[#6])c3-[#8]C([#6])([#6])[#6]=[#6]-c3c2-[#8]-1
InChI Key InChIKey=FUBFEZXQVKEAMQ-NRFANRHFSA-N
Data  1 IC50
  Tab Delimited (TSV)   2D SDfile   Computed 3D by Vconf -m prep SDfile
Find this compound or compounds like it in BindingDB:
Activity Spreadsheet -- Enzyme Inhibition Constant Data from BindingDB
Found 1 hit for monomerid = 50241687
TargetOrnithine decarboxylase(Homo sapiens (Human))
University Of California
Curated by ChEMBL
LigandPNGBDBM50241687((2S)-6-(gamma,gamma-dimethylallyl)-5-hydroxy-3',4'...)
Affinity DataIC50:  2.20E+3nM. Assay description: Inhibition of phorbol ester-induced ornithine decraboxylase in human MCF7 cells after 6 hrs
In DepthDetails ArticlePubMed